{"text_format":"1","workbook":"xlsx","n_sheets":5,"sheets":["Instructions","Name 1 Rx Sheet","Name 1 Doctors","Person 2 Rx Sheet","Person 2 Doctors"],"not_rendered":{"charts":0,"images":2,"macros":0,"external_links":0,"defined_names":2,"comments":0,"pivot_tables":0},"unopened":[],"bounds":{"document_bytes":16777216,"sheet_cells":100000,"rows_first":2000,"rows_last":500,"rows_between":2000,"halvings":0,"cell_chars":16384,"cell_head_chars":4096},"cells_cut":0,"cells_raw":0,"read":"whole","date_system":"1900"}

{"sheet":"Instructions","index":0,"n_rows":40,"n_cols":2,"rows_kept":40,"cut":false,"hidden":false,"merged":[[36,0,36,1],[32,0,32,1],[3,0,3,1],[6,0,6,1],[17,0,17,1]]}
[]
[null,"Medical Information Sheet Instructions"]
[]
["Background:"]
[null,"The sheets were developed to provide a quick, accurate and easy to use picture of our medical condition.And…save time when going through the tedious “New Patient” enrollment process."]
[]
["About the Excel Document:"]
[null,"The document has 4 “worksheets” (identified at bottom left below).  They are set up to provide a front and back for two different people.  The name of each of the worksheets are:"]
[null,"·        “Name 1 Rx Sheet” – the front of one sheet for person 1"]
[null,"·        “Name 1 Doctors” – the back of one sheet for person 1"]
[null,"·        “Person 2 Rx Sheet” – the front of second sheet for person 2"]
[null,"·        “Person 2 Doctors” – the back of second sheet for person 2"]
[]
[null,"NOTES: "]
[null,"1.     The front and back for Person 1 differs slightly from those for Person 2.  Person 1 evolved for someone with more medical history to be documented. So…it’s laid out differently."]
[null,"2.     Because this document was created long ago, when you save the document a message will appear that ESSENTIALLY says this is an old document and saving it may result in some loss of data or formatting.  JUST IGNORE AND CLICK OK OR SAVE."]
[]
["Design & Printing:"]
[null,"The forms are designed so that when you print them you will have four fronts (or backs) on a piece of paper.  When printing, you will have to experiment in order to learn how to print the front on one side and the back on the same piece of paper.  First print the front, then…Printers are different so experiment until you learn how to return the printed front into the paper feeder, then print the back on the same piece of paper.You then cut the sheet so you wind up with 4 copies of the form (See images below).  This was done so my wife & I could each carry two copies for both of us.  This way, we can give one away to someone and still have one for our own reference."]
[]
[]
[]
[]
[]
[]
[]
[]
[]
[]
[]
[]
[]
["About each individual Worksheet:"]
[null,"On each worksheet:"]
[null,"·        You only need to enter information (and PLEASE ONLY enter information) into the TOP LEFT FORM.  The form is set up to duplicate the same data in the other three forms."]
[null,"·        The date is automatically updated each time you open the file.  This makes it easy to see which one is current."]
["Agreement regarding use:"]
[null,"Downloading and using this document is acknowledgement that you agree to the following:"]
[null,"·        This form is free for those who I send the form to and their families and friends to use for their personal use"]
[null,"·        You may not sell or modify and then sell this form at any time without written approval from Results Marketing, Inc."]

{"sheet":"Name 1 Rx Sheet","index":1,"n_rows":53,"n_cols":9,"rows_kept":53,"cut":false,"hidden":false,"merged":[[52,0,52,3],[32,5,32,7],[17,5,19,8],[52,5,52,8],[47,0,47,3],[47,5,47,8],[49,0,51,3],[49,5,51,8],[46,5,46,8],[46,0,46,3],[0,0,0,2],[0,5,0,7],[17,0,19,3],[32,0,32,2],[20,0,20,3],[20,5,20,8],[15,0,15,3],[15,5,15,8],[14,0,14,3],[14,5,14,8]]}
["Your Name Rx List",null,null,{"$f":"'Person 2 Rx Sheet'!D1","v":"2019-02-07"},null,{"$f":"A1","v":"Your Name Rx List"},null,null,{"$f":"D1","v":"2019-02-07"}]
["What/Generic","Dose","Frequency","When (AM/PM)",null,{"$f":"A2","v":"What/Generic"},{"$f":"B2","v":"Dose"},{"$f":"C2","v":"Frequency"},{"$f":"D2","v":"When (AM/PM)"}]
[]
[null,null,null,null,null,{"$f":"(IF(A4=\"\",\"\",A4))","v":""},{"$f":"B4","v":0},{"$f":"C4","v":0},{"$f":"D4","v":0}]
[null,null,null,null,null,"",{"$f":"B5","v":0},{"$f":"C5","v":0},{"$f":"D5","v":0}]
[null,null,null,null,null,"",0,0,0]
[null,null,null,null,null,"",0,0,0]
[null,null,null,null,null,"",0,0,0]
[null,null,null,null,null,"",0,0,0]
[null,null,null,null,null,"",0,0,0]
[null,null,null,null,null,"",0,0,0]
[null,null,null,null,null,"",{"$f":"(IF(B12=\"\",\"\",B12))","v":""},"",""]
[null,null,null,null,null,"","","",""]
[null,null,null,null,null,"","","",""]
["Medical device if any listed here ",null,null,null,null,{"$f":"(IF(A15=\"\",\"\",A15))","v":"Medical device if any listed here "},{"$f":"(IF(B15=\"\",\"\",B15))","v":""},{"$f":"(IF(C15=\"\",\"\",C15))","v":""},{"$f":"(IF(D15=\"\",\"\",D15))","v":""}]
["Allergy or Important Note",null,null,null,null,"Allergy or Important Note"]
["Vitimins & Supplements",null,null,null,null,{"$f":"A17","v":"Vitimins & Supplements"},{"$f":"IF(B17=\"\",\"\",B17)","v":""},{"$f":"IF(C17=\"\",\"\",C17)","v":""},{"$f":"IF(D17=\"\",\"\",D17)","v":""}]
["List here - Suggested format B12, C, D3, CoQ 10, DHEA,  Baby Asprin (pm), ",null,null,null,null,{"$f":"A18","v":"List here - Suggested format B12, C, D3, CoQ 10, DHEA,  Baby Asprin (pm), "}]
[]
[]
["Allergy or Important Note",null,null,null,null,{"$f":"A21","v":"Allergy or Important Note"}]
[]
[]
[]
[]
[]
[]
[]
[]
[]
[]
[]
[{"$f":"A1","v":"Your Name Rx List"},null,null,{"$f":"D1","v":"2019-02-07"},null,{"$f":"A33","v":"Your Name Rx List"},null,null,{"$f":"D33","v":"2019-02-07"}]
[{"$f":"A2","v":"What/Generic"},{"$f":"B2","v":"Dose"},{"$f":"C2","v":"Frequency"},{"$f":"D2","v":"When (AM/PM)"},null,{"$f":"A34","v":"What/Generic"},{"$f":"B34","v":"Dose"},{"$f":"C34","v":"Frequency"},{"$f":"D34","v":"When (AM/PM)"}]
[]
[{"$f":"IF(A4=\"\",\"\",A4)","v":""},{"$f":"B4","v":0},0,0,null,{"$f":"(IF(A36=\"\",\"\",A36))","v":""},{"$f":"B36","v":0},{"$f":"C36","v":0},{"$f":"D36","v":0}]
["",0,0,0,null,"",{"$f":"B37","v":0},{"$f":"C37","v":0},{"$f":"D37","v":0}]
["",0,0,0,null,"",0,0,0]
["",0,0,0,null,"",0,0,0]
["",0,0,0,null,"",0,0,0]
["",0,0,0,null,"",0,0,0]
["",0,0,0,null,"",0,0,0]
["",{"$f":"B11","v":0},0,0,null,"",0,0,0]
["",{"$f":"IF(B12=\"\",\"\",B12)","v":""},"","",null,"",{"$f":"(IF(B44=\"\",\"\",B44))","v":""},"",""]
["","","","",null,"","","",""]
["","","","",null,"","","",""]
[{"$f":"A15","v":"Medical device if any listed here "},{"$f":"IF(B16=\"\",\"\",B16)","v":""},{"$f":"IF(C16=\"\",\"\",C16)","v":""},{"$f":"IF(D16=\"\",\"\",D16)","v":""},null,{"$f":"A15","v":"Medical device if any listed here "},"","",""]
[{"$f":"IF(A16=\"\",\"\",A16)","v":"Allergy or Important Note"},null,null,null,null,{"$f":"IF(A16=\"\",\"\",A16)","v":"Allergy or Important Note"}]
[{"$f":"IF(A17=\"\",\"\",A17)","v":"Vitimins & Supplements"},{"$f":"IF(B17=\"\",\"\",B17)","v":""},{"$f":"IF(C17=\"\",\"\",C17)","v":""},{"$f":"IF(D17=\"\",\"\",D17)","v":""},null,{"$f":"IF(A49=\"\",\"\",A49)","v":"Vitimins & Supplements"},{"$f":"IF(B49=\"\",\"\",B49)","v":""},{"$f":"IF(C49=\"\",\"\",C49)","v":""},{"$f":"IF(D49=\"\",\"\",D49)","v":""}]
[{"$f":"A18","v":"List here - Suggested format B12, C, D3, CoQ 10, DHEA,  Baby Asprin (pm), "},null,null,null,null,{"$f":"A18","v":"List here - Suggested format B12, C, D3, CoQ 10, DHEA,  Baby Asprin (pm), "}]
[]
[]
[{"$f":"A21","v":"Allergy or Important Note"},null,null,null,null,{"$f":"A21","v":"Allergy or Important Note"}]

{"sheet":"Name 1 Doctors","index":2,"n_rows":45,"n_cols":9,"rows_kept":45,"cut":false,"hidden":false,"merged":[[35,0,35,1],[38,2,38,3],[43,2,43,3],[40,7,40,8],[41,7,41,8],[42,7,42,8],[43,7,43,8],[36,0,36,1],[39,2,39,3],[40,2,40,3],[42,0,42,1],[41,0,41,1],[38,0,38,1],[39,7,39,8],[41,2,41,3],[42,2,42,3],[5,0,5,1],[6,0,6,1],[32,5,32,6],[11,0,11,1],[10,0,10,1],[10,2,10,3],[11,2,11,3],[31,0,31,2],[7,0,7,1],[8,2,8,3],[9,2,9,3],[8,0,8,1],[9,0,9,1],[0,0,0,2],[0,5,0,7],[3,0,3,1],[4,0,4,1],[1,2,1,3],[3,5,3,6],[1,0,1,1],[1,5,1,6],[1,7,1,8],[4,5,4,6],[38,7,38,8],[31,5,31,7],[34,5,34,6],[35,5,35,6],[7,7,7,8],[8,7,8,8],[6,5,6,6],[7,5,7,6],[5,5,5,6],[36,5,36,6],[37,5,37,6],[38,5,38,6],[12,7,12,8],[7,2,7,3],[13,0,21,3],[8,5,8,6],[9,5,9,6],[10,5,10,6],[11,5,11,6],[12,5,12,6],[13,5,21,8],[12,2,12,3],[9,7,9,8],[10,7,10,8],[11,7,11,8],[40,0,40,1],[12,0,12,1],[43,0,43,1],[44,0,52,3],[39,5,39,6],[40,5,40,6],[41,5,41,6],[42,5,42,6],[43,5,43,6],[44,5,52,8],[39,0,39,1],[32,7,32,8],[32,0,32,1],[32,2,32,3],[37,0,37,1],[34,0,34,1]]}
["Name Here",null,null,{"$f":"'Person 2 Rx Sheet'!D1","v":"2019-02-07"},null,{"$f":"A1","v":"Name Here"},null,null,{"$f":"D1","v":"2019-02-07"}]
["Dr.  Information & Medical History",null,"Emergency Contacts",null,null,{"$f":"A2","v":"Dr.  Information & Medical History"},null,{"$f":"C2","v":"Emergency Contacts"}]
[]
["Street Address",null,"Name","Name; Brother",null,{"$f":"(IF(A4=\"\",\"\",A4))","v":"Street Address"},null,{"$f":"C4","v":"Name"},"Name; Brother"]
["Reno, NV 99999",null,"Husband","c - 999.999.9999",null,{"$f":"(IF(A5=\"\",\"\",A5))","v":"Reno, NV 99999"},null,"Husband","c - 999.999.9999"]
["home 999.999.9999  cell 999.999.9999",null,"H-999.999.9999","Name - Son",null,{"$f":"(IF(A6=\"\",\"\",A6))","v":"home 999.999.9999  cell 999.999.9999"},null,"H-999.999.9999","Name - Son"]
["DOB-1/23/85 (Age 99) ",null,"C999.999.9999","c - 999.999.9999",null,{"$f":"(IF(A7=\"\",\"\",A7))","v":"DOB-1/23/85 (Age 99) "},null,"C999.999.9999","c - 999.999.9999"]
["Rx=Costco 999.999.9999 ",null,"Primary Care - Dr. Name",null,null,{"$f":"A8","v":"Rx=Costco 999.999.9999 "},null,{"$f":"C8","v":"Primary Care - Dr. Name"},{"$f":"(IF(D7=\"\",\"\",D7))","v":"c - 999.999.9999"}]
["Specialty (I.e., Heart)-Dr. Name",null,"Street Address & Suite",null,null,"Specialty (I.e., Heart)-Dr. Name",null,{"$f":"C9","v":"Street Address & Suite"}]
["Street Address & Suite",null,"Reno, NV 99999      ph 999.999.9999",null,null,"Street Address & Suite",null,{"$f":"C10","v":"Reno, NV 99999      ph 999.999.9999"}]
["Reno, NV 99999      ph  999.999.9999",null,"Specailty 3 - Dr. Name",null,null,"Reno, NV 99999      ph  999.999.9999",null,{"$f":"A9","v":"Specialty (I.e., Heart)-Dr. Name"}]
["Specialty 2 - Dr. Name 999.999.9999",null,"Street Address & Suite",null,null,"Specialty 2 - Dr. Name 999.999.9999",null,{"$f":"A10","v":"Street Address & Suite"}]
["Address",null,"Reno, NV 99999           ph 999.999.9999",null,null,"Address",null,{"$f":"A11","v":"Reno, NV 99999      ph  999.999.9999"}]
["Medical History - replace this but format suggestion is - Rotator Cuff Surgery ('09); #L2-L5 Back Surgery ('14);",null,null,null,null,{"$f":"A14","v":"Medical History - replace this but format suggestion is - Rotator Cuff Surgery ('09); #L2-L5 Back Surgery ('14);"}]
[]
[]
[]
[]
[]
[]
[]
[]
[]
[]
[]
[]
[]
[]
[]
[]
[]
[{"$f":"A1","v":"Name Here"},null,null,{"$f":"D1","v":"2019-02-07"},null,{"$f":"A32","v":"Name Here"},null,null,{"$f":"D32","v":"2019-02-07"}]
[{"$f":"A2","v":"Dr.  Information & Medical History"},null,{"$f":"C2","v":"Emergency Contacts"},null,null,{"$f":"A33","v":"Dr.  Information & Medical History"},{"$f":"B33","v":0},{"$f":"C33","v":"Emergency Contacts"},{"$f":"D33","v":0}]
[]
[{"$f":"IF(A4=\"\",\"\",A4)","v":"Street Address"},null,{"$f":"C4","v":"Name"},"Name; Brother",null,{"$f":"(IF(A35=\"\",\"\",A35))","v":"Street Address"},null,{"$f":"(IF(C35=\"\",\"\",C35))","v":"Name"},"Name; Brother"]
[{"$f":"IF(A5=\"\",\"\",A5)","v":"Reno, NV 99999"},null,"Husband","c - 999.999.9999",null,{"$f":"(IF(A36=\"\",\"\",A36))","v":"Reno, NV 99999"},null,"Husband","c - 999.999.9999"]
[{"$f":"IF(A6=\"\",\"\",A6)","v":"home 999.999.9999  cell 999.999.9999"},null,"H-999.999.9999","Name - Son",null,{"$f":"(IF(A37=\"\",\"\",A37))","v":"home 999.999.9999  cell 999.999.9999"},null,"H-999.999.9999","Name - Son"]
[{"$f":"IF(A7=\"\",\"\",A7)","v":"DOB-1/23/85 (Age 99) "},null,"C999.999.9999","c - 999.999.9999",null,{"$f":"(IF(A38=\"\",\"\",A38))","v":"DOB-1/23/85 (Age 99) "},null,"C999.999.9999","c - 999.999.9999"]
[{"$f":"A8","v":"Rx=Costco 999.999.9999 "},null,{"$f":"C8","v":"Primary Care - Dr. Name"},null,null,{"$f":"A8","v":"Rx=Costco 999.999.9999 "},null,{"$f":"C39","v":"Primary Care - Dr. Name"},{"$f":"D7","v":"c - 999.999.9999"}]
["Specialty (I.e., Heart)-Dr. Name",null,{"$f":"C9","v":"Street Address & Suite"},null,null,"Specialty (I.e., Heart)-Dr. Name",null,"Street Address & Suite"]
["Street Address & Suite",null,{"$f":"C10","v":"Reno, NV 99999      ph 999.999.9999"},null,null,"Street Address & Suite",null,"Reno, NV 99999      ph 999.999.9999"]
["Reno, NV 99999      ph  999.999.9999",null,{"$f":"A9","v":"Specialty (I.e., Heart)-Dr. Name"},null,null,"Reno, NV 99999      ph  999.999.9999",null,"Specialty (I.e., Heart)-Dr. Name"]
["Specialty 2 - Dr. Name 999.999.9999",null,{"$f":"A10","v":"Street Address & Suite"},null,null,"Specialty 2 - Dr. Name 999.999.9999",null,"Street Address & Suite"]
["Address",null,{"$f":"A11","v":"Reno, NV 99999      ph  999.999.9999"},null,null,"Address",null,"Reno, NV 99999      ph  999.999.9999"]
[{"$f":"A14","v":"Medical History - replace this but format suggestion is - Rotator Cuff Surgery ('09); #L2-L5 Back Surgery ('14);"},null,null,null,null,{"$f":"A14","v":"Medical History - replace this but format suggestion is - Rotator Cuff Surgery ('09); #L2-L5 Back Surgery ('14);"}]

{"sheet":"Person 2 Rx Sheet","index":3,"n_rows":56,"n_cols":11,"rows_kept":56,"cut":false,"hidden":false,"merged":[[54,0,55,3],[54,5,55,8],[33,0,33,2],[33,5,33,7],[53,0,53,1],[53,5,53,6],[21,0,22,3],[21,5,22,8],[0,0,0,2],[0,5,0,7],[20,0,20,1],[20,5,20,6]]}
["Name's Rx List",null,null,{"$f":"TODAY()","v":"2019-02-07"},null,{"$f":"A1","v":"Name's Rx List"},null,null,{"$f":"D1","v":"2019-02-07"}]
["What/Generic","Dose","Frequency","When",null,{"$f":"A2","v":"What/Generic"},{"$f":"B2","v":"Dose"},{"$f":"C2","v":"Frequency"},{"$f":"D2","v":"When"}]
[]
[]
[null,null,null,null,null,{"$f":"(IF(A5=\"\",\"\",A5))","v":""},{"$f":"(IF(B5=\"\",\"\",B5))","v":""},"",""]
[null,null,null,null,null,"","","",""]
[null,null,null,null,null,"","","",""]
[null,null,null,null,null,"","","",""]
[null,null,null,null,null,"","","",""]
[null,null,null,null,null,"",{"$f":"(IF(B10=\"\",\"\",B10))","v":""},{"$f":"(IF(C10=\"\",\"\",C10))","v":""},{"$f":"(IF(D10=\"\",\"\",D10))","v":""}]
[null,null,null,null,null,"","","","",null," "]
[null,null,null,null,null,"","","",""]
[null,null,null,null,null,"","","",""]
[null,null,null,null,null,"","","",""]
[null,null,null,null,null,"","","",""]
[null,null,null,null,null,"","","",""]
[null,null,null,null,null,"","","",""]
[null,null,null,null,null,"","","",""]
[null,null,null,null,null,"","","",""]
[null,null,null,null,null,"","","",""]
["Vitimins & Supplements",null,null,null,null,"Vitimins & Supplements"]
["List here - Suggested format B12, C, D3, CoQ 10, DHEA,  Baby Asprin (pm),  ",null,null,null,null,{"$f":"A22","v":"List here - Suggested format B12, C, D3, CoQ 10, DHEA,  Baby Asprin (pm),  "}]
[null,null,null,null,null,{"$f":"A23","v":0}]
[]
[]
[]
[]
[]
[]
[]
[]
[]
[]
[{"$f":"A1","v":"Name's Rx List"},null,null,{"$f":"D1","v":"2019-02-07"},null,{"$f":"A34","v":"Name's Rx List"},null,null,{"$f":"D34","v":"2019-02-07"}]
[{"$f":"A2","v":"What/Generic"},{"$f":"B2","v":"Dose"},{"$f":"C2","v":"Frequency"},{"$f":"D2","v":"When"},null,{"$f":"A35","v":"What/Generic"},{"$f":"B35","v":"Dose"},{"$f":"C35","v":"Frequency"},{"$f":"D35","v":"When"}]
[]
[]
[{"$f":"IF(A5=\"\",\"\",A5)","v":""},"","","",null,{"$f":"(IF(A38=\"\",\"\",A38))","v":""},{"$f":"(IF(B38=\"\",\"\",B38))","v":""},"",""]
["","","","",null,{"$f":"(IF(A39=\"\",\"\",A39))","v":""},"","",""]
["","","","",null,"","","",""]
[{"$f":"IF(A8=\"\",\"\",A8)","v":""},{"$f":"IF(B8=\"\",\"\",B8)","v":""},{"$f":"IF(C8=\"\",\"\",C8)","v":""},{"$f":"IF(D8=\"\",\"\",D8)","v":""},null,"","","",""]
["","","","",null,"","","",""]
["","","","",null,"","","",""]
["","","","",null,"","","",""]
["","","","",null,"","","",""]
["","","","",null,"","","",""]
["","","","",null,"","","",""]
[{"$f":"IF(A15=\"\",\"\",A15)","v":""},"","","",null,"","","",""]
["","","","",null,"","","",""]
["","","","",null,"","","",""]
["","","","",null,"","","",""]
["","","","",null,"","","",""]
["","","","",null,{"$f":"(IF(A53=\"\",\"\",A53))","v":""},{"$f":"(IF(B53=\"\",\"\",B53))","v":""},{"$f":"(IF(C53=\"\",\"\",C53))","v":""},{"$f":"(IF(D53=\"\",\"\",D53))","v":""}]
[{"$f":"IF(A21=\"\",\"\",A21)","v":"Vitimins & Supplements"},"",null,null,null,{"$f":"(IF(A54=\"\",\"\",A54))","v":"Vitimins & Supplements"}]
["List here - Suggested format B12, C, D3, CoQ 10, DHEA,  Baby Asprin (pm),  ","","","",null,{"$f":"A55","v":"List here - Suggested format B12, C, D3, CoQ 10, DHEA,  Baby Asprin (pm),  "}]
["","","","",null,{"$f":"A56","v":""}]

{"sheet":"Person 2 Doctors","index":4,"n_rows":56,"n_cols":9,"rows_kept":56,"cut":false,"hidden":false,"merged":[[50,5,50,6],[43,0,43,1],[43,2,43,3],[49,0,49,1],[49,5,49,6],[50,0,50,1],[12,7,22,8],[45,2,55,3],[45,7,55,8],[17,5,17,6],[51,5,51,6],[43,5,43,6],[43,7,43,8],[34,5,34,8],[13,5,13,6],[44,7,44,8],[54,0,54,1],[54,5,54,6],[53,0,53,1],[55,0,55,1],[55,5,55,6],[53,5,53,6],[51,0,51,1],[52,0,52,1],[52,5,52,6],[42,7,42,8],[47,0,47,1],[47,5,47,6],[48,0,48,1],[48,5,48,6],[45,0,45,1],[45,5,45,6],[46,0,46,1],[46,5,46,6],[44,0,44,1],[44,2,44,3],[44,5,44,6],[38,0,38,1],[38,5,38,6],[39,0,39,1],[39,5,39,6],[41,0,41,1],[41,5,41,6],[42,0,42,1],[42,2,42,3],[42,5,42,6],[40,0,40,1],[40,5,40,6],[37,7,37,8],[18,5,18,6],[33,0,33,2],[33,5,33,7],[34,0,34,3],[21,5,21,6],[22,0,22,1],[22,5,22,6],[37,0,37,1],[37,2,37,3],[37,5,37,6],[21,0,21,1],[13,0,13,1],[11,0,11,1],[11,2,11,3],[20,0,20,1],[19,0,19,1],[19,5,19,6],[20,5,20,6],[14,0,14,1],[14,5,14,6],[15,5,15,6],[16,0,16,1],[15,0,15,1],[18,0,18,1],[12,2,22,3],[17,0,17,1],[16,5,16,6],[11,5,11,6],[11,7,11,8],[12,0,12,1],[12,5,12,6],[9,0,9,1],[9,2,9,3],[9,5,9,6],[9,7,9,8],[10,0,10,1],[10,2,10,3],[4,0,4,1],[4,2,4,3],[0,0,0,2],[0,5,0,7],[1,0,1,3],[1,5,1,8],[4,5,4,6],[4,7,4,8],[10,5,10,6],[10,7,10,8],[5,5,5,6],[6,0,6,1],[6,5,6,6],[7,0,7,1],[7,5,7,6],[8,0,8,1],[8,5,8,6],[5,0,5,1]]}
["Name Here",null,null,{"$f":"'Person 2 Rx Sheet'!D1","v":"2019-02-07"},null,{"$f":"A1","v":"Name Here"},null,null,{"$f":"D1","v":"2019-02-07"}]
["Doctor Information & Medical History",null,null,null,null,{"$f":"A2","v":"Doctor Information & Medical History"},{"$f":"B2","v":0},{"$f":"C2","v":0},{"$f":"D2","v":0}]
[]
[]
["Name",null,"Emergency Contacts",null,null,{"$f":"(IF(A5=\"\",\"\",A5))","v":"Name"},{"$f":"(IF(B5=\"\",\"\",B5))","v":""},{"$f":"(IF(C5=\"\",\"\",C5))","v":"Emergency Contacts"},{"$f":"(IF(D5=\"\",\"\",D5))","v":""}]
["Street Address",null,"Mary Smith","Russell Smith - son",null,{"$f":"(IF(A6=\"\",\"\",A6))","v":"Street Address"},null,{"$f":"(IF(C6=\"\",\"\",C6))","v":"Mary Smith"},"Russell Smith - son"]
["City, State & Zip",null,"Wife","c  999.999.9999",null,"City, State & Zip",null,"Wife","c  999.999.9999"]
["Phone- H .999.999.9999",null,"h-999.999.9999","Stuart Smith-B-in-Law",null,"Phone- H .999.999.9999",null,"h-999.999.9999","Stuart Smith-B-in-Law"]
["cell 999.999.9999",null,"c-999.999.9999","c  999.999.9999",null,"cell 999.999.9999",null,"c-999.999.9999","c  999.999.9999"]
["DOB - 1/2/85 - Age 99",null,"Rx - Local Name Rx.",null,null,"DOB - 1/2/85 - Age 99",null,{"$f":"(IF(C10=\"\",\"\",C10))","v":"Rx - Local Name Rx."}]
["Organ Doner - Yes or NO",null,"Street or Area      999.999.9999",null,null,"Organ Doner - Yes or NO",null,{"$f":"(IF(C11=\"\",\"\",C11))","v":"Street or Area      999.999.9999"}]
["Primary Dr . -  - Name",null,"Rx- Mail Order - Pharmacy Name",null,null,"Primary Dr . -  - Name",null,{"$f":"(IF(C12=\"\",\"\",C12))","v":"Rx- Mail Order - Pharmacy Name"}]
["775.999.9999",null,"Medical History - replace this but format suggestion to use is  - Rotator Cuff Surgery ('09); #L2-L5 Back Surgery ('14); ",null,null,"775.999.9999",null,{"$f":"C13","v":"Medical History - replace this but format suggestion to use is  - Rotator Cuff Surgery ('09); #L2-L5 Back Surgery ('14); "}]
["Street Address & Suite #",null,null,null,null,"Street Address & Suite #"]
["Reno, NV 89502    ph 775.999.9999",null,null,null,null,"Reno, NV 89502    ph 775.999.9999",{"$f":"(IF(B15=\"\",\"\",B15))","v":""}]
["Specialty (I.e., Heart) Dr. - - Dr. Name",null,null,null,null,"Specialty (I.e., Heart) Dr. - - Dr. Name",{"$f":"(IF(B16=\"\",\"\",B16))","v":""}]
["Office - 775.999.9999",null,null,null,null,"Office - 775.999.9999",{"$f":"(IF(B17=\"\",\"\",B17))","v":""}]
["Street Address & Suite #",null,null,null,null,"Street Address & Suite #",{"$f":"(IF(B18=\"\",\"\",B18))","v":""}]
["Reno, NV 89999",null,null,null,null,"Reno, NV 89999"]
["Important Note",null,null,null,null,"Important Note"]
["ALLERGIES",null,null,null,null,{"$f":"(IF(A21=\"\",\"\",A21))","v":"ALLERGIES"}]
["List or Say None Here",null,null,null,null,{"$f":"(IF(A22=\"\",\"\",A22))","v":"List or Say None Here"}]
["Additional or what happens here",null,null,null,null,{"$f":"(IF(A23=\"\",\"\",A23))","v":"Additional or what happens here"}]
[]
[]
[]
[]
[]
[]
[]
[]
[]
[]
[{"$f":"A1","v":"Name Here"},null,null,{"$f":"D1","v":"2019-02-07"},null,{"$f":"A34","v":"Name Here"},null,null,{"$f":"D34","v":"2019-02-07"}]
[{"$f":"A2","v":"Doctor Information & Medical History"},null,null,null,null,{"$f":"A35","v":"Doctor Information & Medical History"}]
[]
[]
[{"$f":"IF(A5=\"\",\"\",A5)","v":"Name"},null,"Emergency Contacts",null,null,{"$f":"(IF(A38=\"\",\"\",A38))","v":"Name"},null,{"$f":"(IF(C38=\"\",\"\",C38))","v":"Emergency Contacts"}]
["Street Address",null,{"$f":"C6","v":"Mary Smith"},"Russell Smith - son",null,{"$f":"(IF(A39=\"\",\"\",A39))","v":"Street Address"},null,"Mary Smith","Russell Smith - son"]
["City, State & Zip",null,"Wife","c  999.999.9999",null,"City, State & Zip",null,"Wife","c  999.999.9999"]
["Phone- H .999.999.9999",null,"h-999.999.9999",{"$f":"D8","v":"Stuart Smith-B-in-Law"},null,"Phone- H .999.999.9999",null,"h-999.999.9999",{"$f":"D8","v":"Stuart Smith-B-in-Law"}]
["cell 999.999.9999",null,"c-999.999.9999","c  999.999.9999",null,"cell 999.999.9999",null,"c-999.999.9999","c  999.999.9999"]
["DOB - 1/2/85 - Age 99",null,{"$f":"IF(C10=\"\",\"\",C10)","v":"Rx - Local Name Rx."},null,null,"DOB - 1/2/85 - Age 99",null,"Rx - Local Name Rx."]
["Organ Doner - Yes or NO",null,{"$f":"C11","v":"Street or Area      999.999.9999"},null,null,"Organ Doner - Yes or NO",null,"Street or Area      999.999.9999"]
["Primary Dr . -  - Name",null,{"$f":"IF(C12=\"\",\"\",C12)","v":"Rx- Mail Order - Pharmacy Name"},null,null,"Primary Dr . -  - Name",null,"Rx- Mail Order - Pharmacy Name"]
["775.999.9999",null,{"$f":"C13","v":"Medical History - replace this but format suggestion to use is  - Rotator Cuff Surgery ('09); #L2-L5 Back Surgery ('14); "},null,null,"775.999.9999",null,{"$f":"C13","v":"Medical History - replace this but format suggestion to use is  - Rotator Cuff Surgery ('09); #L2-L5 Back Surgery ('14); "}]
["Street Address & Suite #",null,null,null,null,"Street Address & Suite #"]
["Reno, NV 89502    ph 775.999.9999",null,null,null,null,"Reno, NV 89502    ph 775.999.9999"]
["Specialty (I.e., Heart) Dr. - - Dr. Name",null,null,null,null,"Specialty (I.e., Heart) Dr. - - Dr. Name"]
["Office - 775.999.9999",null,null,null,null,"Office - 775.999.9999"]
["Street Address & Suite #",null,null,null,null,"Street Address & Suite #"]
["Reno, NV 89999",null,null,null,null,"Reno, NV 89999"]
["Important Note",null,null,null,null,"Important Note"]
["ALLERGIES",null,null,null,null,{"$f":"(IF(A54=\"\",\"\",A54))","v":"ALLERGIES"}]
["List or Say None Here",null,null,null,null,{"$f":"A55","v":"List or Say None Here"}]
["Additional or what happens here",null,null,null,null,{"$f":"A56","v":"Additional or what happens here"}]